{"text_format":"1","workbook":"xlsx","n_sheets":3,"sheets":["REF","LISTING","FT"],"not_rendered":{"charts":0,"images":0,"macros":1,"external_links":0,"defined_names":1,"comments":1,"pivot_tables":0},"unopened":[],"bounds":{"document_bytes":16777216,"sheet_cells":100000,"rows_first":2000,"rows_last":500,"rows_between":2000,"halvings":0,"cell_chars":16384,"cell_head_chars":4096},"cells_cut":0,"cells_raw":0,"read":"whole","date_system":"1900"}

{"sheet":"REF","index":0,"n_rows":9,"n_cols":3,"rows_kept":9,"cut":false,"hidden":false,"merged":[]}
["Listing des lots du CDC"]
["LOTS","Entreprise responsable","Entrprise sous-traitant"]
["-"]
["GO"]
["STAB"]
["ELEC"]
["CH"]
["SAN"]
["VMC"]

{"sheet":"LISTING","index":1,"n_rows":53,"n_cols":24,"rows_kept":53,"cut":false,"hidden":false,"merged":[[1,15,1,23]]}
["Listing des fiches techniques",null,null,null,"2018-02-20","Date Mise à Jour du Fichier"]
["ID","N° Fiche","Indice","Date Emission","Date Mise à Jour","Référence CSC","Conforme CSC","Lot","Stade","Description","Localisation","Marque","Type","Epaisseur","Remarques","Approbation"]
[null,null,null,"[AAAA-MM-JJ]","[AAAA-MM-JJ]",null,"OUI / NON",null,"SOU / EXE","Texte libre","Texte libre","Texte libre","Texte libre","[mm]","Texte libre",{"$f":"FT!B23","v":"MO/PM"},{"$f":"FT!B24","v":"AR"},{"$f":"FT!B25","v":"IS"},{"$f":"FT!B26","v":"TS"},{"$f":"FT!B27","v":"PEB"},{"$f":"FT!B28","v":"CSS"},{"$f":"FT!B29","v":"-"},{"$f":"FT!B30","v":"-"},{"$f":"FT!B31","v":"-"}]
[0,"EX","B","2018-01-01","2018-02-20","3.2.2","NON","GO","SOU","Isolation dalle sur sol","Dalle sous-sol cave n°1","Recticel","Eurothane Bi-4",120,"Pose sur sable stabilisé avec visqueen","-","-","-","-","-","-","-","-","-"]
[1,"FT.01","A",null,null,null,"-","-","-",null,null,null,null,null,null,"-","-","-","-","-","-","-","-","-"]
[2,"FT.02","A",null,null,null,"-","-","-",null,null,null,null,null,null,"-","-","-","-","-","-","-","-","-"]
[3,"FT.03","A",null,null,null,"-","-","-",null,null,null,null,null,null,"-","-","-","-","-","-","-","-","-"]
[4,"FT.04","A",null,null,null,"-","-","-",null,null,null,null,null,null,"-","-","-","-","-","-","-","-","-"]
[5,"FT.05","A",null,null,null,"-","-","-",null,null,null,null,null,null,"-","-","-","-","-","-","-","-","-"]
[6,"FT.06","A",null,null,null,"-","-","-",null,null,null,null,null,null,"-","-","-","-","-","-","-","-","-"]
[7,"FT.07","A",null,null,null,"-","-","-",null,null,null,null,null,null,"-","-","-","-","-","-","-","-","-"]
[8,"FT.08","A",null,null,null,"-","-","-",null,null,null,null,null,null,"-","-","-","-","-","-","-","-","-"]
[9,"FT.09","A",null,null,null,"-","-","-",null,null,null,null,null,null,"-","-","-","-","-","-","-","-","-"]
[10,"FT.10","A",null,null,null,"-","-","-",null,null,null,null,null,null,"-","-","-","-","-","-","-","-","-"]
[11,"FT.11","A",null,null,null,"-","-","-",null,null,null,null,null,null,"-","-","-","-","-","-","-","-","-"]
[12,"FT.12","A",null,null,null,"-","-","-",null,null,null,null,null,null,"-","-","-","-","-","-","-","-","-"]
[13,"FT.13","A",null,null,null,"-","-","-",null,null,null,null,null,null,"-","-","-","-","-","-","-","-","-"]
[14,"FT.14","A",null,null,null,"-","-","-",null,null,null,null,null,null,"-","-","-","-","-","-","-","-","-"]
[15,"FT.15","A",null,null,null,"-","-","-",null,null,null,null,null,null,"-","-","-","-","-","-","-","-","-"]
[16,"FT.16","A",null,null,null,"-","-","-",null,null,null,null,null,null,"-","-","-","-","-","-","-","-","-"]
[17,"FT.17","A",null,null,null,"-","-","-",null,null,null,null,null,null,"-","-","-","-","-","-","-","-","-"]
[18,"FT.18","A",null,null,null,"-","-","-",null,null,null,null,null,null,"-","-","-","-","-","-","-","-","-"]
[19,"FT.19","A",null,null,null,"-","-","-",null,null,null,null,null,null,"-","-","-","-","-","-","-","-","-"]
[20,"FT.20","A",null,null,null,"-","-","-",null,null,null,null,null,null,"-","-","-","-","-","-","-","-","-"]
[21,"FT.21","A",null,null,null,"-","-","-",null,null,null,null,null,null,"-","-","-","-","-","-","-","-","-"]
[22,"FT.22","A",null,null,null,"-","-","-",null,null,null,null,null,null,"-","-","-","-","-","-","-","-","-"]
[23,"FT.23","A",null,null,null,"-","-","-",null,null,null,null,null,null,"-","-","-","-","-","-","-","-","-"]
[24,"FT.24","A",null,null,null,"-","-","-",null,null,null,null,null,null,"-","-","-","-","-","-","-","-","-"]
[25,"FT.25","A",null,null,null,"-","-","-",null,null,null,null,null,null,"-","-","-","-","-","-","-","-","-"]
[26,"FT.26","A",null,null,null,"-","-","-",null,null,null,null,null,null,"-","-","-","-","-","-","-","-","-"]
[27,"FT.27","A",null,null,null,"-","-","-",null,null,null,null,null,null,"-","-","-","-","-","-","-","-","-"]
[28,"FT.28","A",null,null,null,"-","-","-",null,null,null,null,null,null,"-","-","-","-","-","-","-","-","-"]
[29,"FT.29","A",null,null,null,"-","-","-",null,null,null,null,null,null,"-","-","-","-","-","-","-","-","-"]
[30,"FT.30","A",null,null,null,"-","-","-",null,null,null,null,null,null,"-","-","-","-","-","-","-","-","-"]
[31,"FT.31","A",null,null,null,"-","-","-",null,null,null,null,null,null,"-","-","-","-","-","-","-","-","-"]
[32,"FT.32","A",null,null,null,"-","-","-",null,null,null,null,null,null,"-","-","-","-","-","-","-","-","-"]
[33,"FT.33","A",null,null,null,"-","-","-",null,null,null,null,null,null,"-","-","-","-","-","-","-","-","-"]
[34,"FT.34","A",null,null,null,"-","-","-",null,null,null,null,null,null,"-","-","-","-","-","-","-","-","-"]
[35,"FT.35","A",null,null,null,"-","-","-",null,null,null,null,null,null,"-","-","-","-","-","-","-","-","-"]
[36,"FT.36","A",null,null,null,"-","-","-",null,null,null,null,null,null,"-","-","-","-","-","-","-","-","-"]
[37,"FT.37","A",null,null,null,"-","-","-",null,null,null,null,null,null,"-","-","-","-","-","-","-","-","-"]
[38,"FT.38","A",null,null,null,"-","-","-",null,null,null,null,null,null,"-","-","-","-","-","-","-","-","-"]
[39,"FT.39","A",null,null,null,"-","-","-",null,null,null,null,null,null,"-","-","-","-","-","-","-","-","-"]
[40,"FT.40","A",null,null,null,"-","-","-",null,null,null,null,null,null,"-","-","-","-","-","-","-","-","-"]
[41,"FT.41","A",null,null,null,"-","-","-",null,null,null,null,null,null,"-","-","-","-","-","-","-","-","-"]
[42,"FT.42","A",null,null,null,"-","-","-",null,null,null,null,null,null,"-","-","-","-","-","-","-","-","-"]
[43,"FT.43","A",null,null,null,"-","-","-",null,null,null,null,null,null,"-","-","-","-","-","-","-","-","-"]
[44,"FT.44","A",null,null,null,"-","-","-",null,null,null,null,null,null,"-","-","-","-","-","-","-","-","-"]
[45,"FT.45","A",null,null,null,"-","-","-",null,null,null,null,null,null,"-","-","-","-","-","-","-","-","-"]
[46,"FT.46","A",null,null,null,"-","-","-",null,null,null,null,null,null,"-","-","-","-","-","-","-","-","-"]
[47,"FT.47","A",null,null,null,"-","-","-",null,null,null,null,null,null,"-","-","-","-","-","-","-","-","-"]
[48,"FT.48","A",null,null,null,"-","-","-",null,null,null,null,null,null,"-","-","-","-","-","-","-","-","-"]
[49,"FT.49","A",null,null,null,null,null,null,null,null,null,null,null,null,"-","-","-","-","-","-","-","-","-"]

{"sheet":"FT","index":2,"n_rows":36,"n_cols":13,"rows_kept":36,"cut":false,"hidden":false,"merged":[[1,10,5,12],[7,1,7,3],[27,2,27,3],[28,2,28,3],[29,2,29,3],[30,2,30,3],[22,6,22,7],[23,6,23,7],[24,6,24,7],[25,6,25,7],[26,6,26,7],[27,6,27,7],[28,6,28,7],[29,6,29,7],[30,6,30,7],[22,2,22,3],[23,2,23,3],[24,2,24,3],[25,2,25,3],[26,2,26,3],[21,6,21,7],[21,2,21,3],[19,1,19,7],[1,1,1,2],[2,1,2,2],[3,1,3,2],[5,1,5,2]]}
[]
[null,"Client / Projet :",null,"FORTHOMME",null,null,{"$f":"CONCATENATE(\"Ref. \",B24)","v":"Ref. AR"},"-",null,null,"1. Corriger les coordonnées de la F.I.\n2. Indiquer la Référence de chaque intervenant\n3. Corriger le pied de page avec coordonnées entreprise\n4. Complétez les informations via l'onglet listing \n5. Choisissez le n°ID de la fiche à imprimer"]
[null,"Adresse Chantier :",null,"Avenue Eugène Demolder 11",null,null,{"$f":"CONCATENATE(\"Ref. \",B25)","v":"Ref. IS"},"-"]
[null,null,null,"1030 Schaerbeek",null,null,"Ref. TS","-"]
[null,null,null,null,null,null,"Ref. PEB","-"]
[null,"Description :",null,"Rénovation Basse-Energie d'une Maison de Maître  ",null,null,"Ref. CSS","-"]
[]
[null,"FICHE D'IDENTIFICATION",null,null,"N° Fiche ",{"$f":"VLOOKUP($L$8,LISTING!$A$4:$O$53,2)","v":"EX"},"Indice ",{"$f":"VLOOKUP($L$8,LISTING!$A$4:$O$53,3)","v":"B"},null,null,"ID",0]
[]
[null,null,null,null,"Date Emission ",{"$f":"VLOOKUP($L$8,LISTING!$A$4:$O$53,4)","v":"2018-01-01"},"Date MàJ ",{"$f":"VLOOKUP($L$8,LISTING!$A$4:$O$53,5)","v":"2018-02-20"}]
[]
[null,"REF. CDC ",null,{"$f":"VLOOKUP($L$8,LISTING!$A$4:$O$53,6)","v":"3.2.2"},null,null,"Conforme CSC ",{"$f":"VLOOKUP($L$8,LISTING!$A$4:$O$53,7)","v":"NON"},null,null,"Template réalisé par :"]
[null,"LOT ",null,{"$f":"VLOOKUP($L$8,LISTING!$A$4:$O$53,8)","v":"GO"},null,null,"Stade",{"$f":"VLOOKUP($L$8,LISTING!$A$4:$O$53,9)","v":"SOU"},null,null,"Brouae architecture & énergies sprl"]
[null,"DESCRIPTION ",null,{"$f":"VLOOKUP($L$8,LISTING!$A$4:$O$53,10)","v":"Isolation dalle sur sol"},null,null,null,null,null,null,"Gérôme Forthomme"]
[null,"LOCALISATION ",null,{"$f":"VLOOKUP($L$8,LISTING!$A$4:$O$53,11)","v":"Dalle sous-sol cave n°1"},null,null,null,null,null,null,"+32 2 647 21 41",null,"Avenue E. Demolder 11"]
[null,"MARQUE ",null,{"$f":"VLOOKUP($L$8,LISTING!$A$4:$O$53,12)","v":"Recticel"},null,null,null,null,null,null,"info@brouae.be",null,"1030 Schaerbeek"]
[null,"TYPE ",null,{"$f":"VLOOKUP($L$8,LISTING!$A$4:$O$53,13)","v":"Eurothane Bi-4"},null,null,"EPAISSEUR ",{"$f":"CONCATENATE(VLOOKUP($L$8,LISTING!$A$4:$O$53,14),\" mm\")","v":"120 mm"},null,null,"http://www.brouae.be",null,"Belgique"]
[]
[null,"REMARQUES"]
[]
[]
[null,"Diffusion","Entreprise / Représentant",null,"Approbation*","Date","Signature"]
[null,"MO/PM",null,null," A  B  C  D "]
[null,"AR",null,null," A  B  C  D "]
[null,"IS",null,null," A  B  C  D "]
[null,"TS",null,null," A  B  C  D "]
[null,"PEB","Brouae sprl\nG. Forthomme",null," A  B  C  D "]
[null,"CSS",null,null," A  B  C  D "]
[null,"-",null,null," A  B  C  D "]
[null,"-",null,null," A  B  C  D "]
[null,"-",null,null," A  B  C  D "]
[]
[null,"A = Approuvée sans remarques",null,null,"C = Incomplète et à représenter",null,null,"* Entourez la LETTRE validée"]
[null,"B = Approuvée en tenant compte des remarques",null,null,"D = Refusée et à représenter"]
[]
[null,"* Cette approbation ne diminue en rien les responsabilités légales et contractuelles du Contractant"]